BDBM50122109 3-Chloro-4-hydroxy-benzoic acid {4-[2-(2-methyl-piperidin-1-yl)-2-oxo-ethyl]-naphthalen-1-ylmethylene}-hydrazide::CHEMBL155065
SMILES CC1CCCCN1C(=O)Cc1ccc(\C=N\NC(=O)c2ccc(O)c(Cl)c2)c2ccccc12
InChI Key InChIKey=WUACEHRKTXWVKL-LQKURTRISA-N
Data  1 IC50
  Tab Delimited (TSV)   2D SDfile   Computed 3D by Vconf -m prep SDfile
Find this compound or compounds like it in BindingDB:
Activity Spreadsheet -- Enzyme Inhibition Constant Data from BindingDB
Found 1 hit for monomerid = 50122109
TargetGlucagon receptor(Homo sapiens (Human))
Novo Nordisk
Curated by ChEMBL
LigandPNGBDBM50122109(3-Chloro-4-hydroxy-benzoic acid {4-[2-(2-methyl-pi...)
Affinity DataIC50:  8.30nM. Assay description: In vitro binding affinity for recombinant human glucagon receptor (hGGR) in BHK cells
In DepthDetails ArticlePubMed