BDBM50122119 3-Chloro-4-hydroxy-benzoic acid {4-[2-(4-trifluoromethoxy-benzylamino)-ethoxy]-naphthalen-1-ylmethylene}-hydrazide::CHEMBL346801
SMILES Oc1ccc(cc1Cl)C(=O)N\N=C\c1ccc(OCCNCc2ccc(OC(F)(F)F)cc2)c2ccccc12
InChI Key InChIKey=RVJHHGIOZBXQDZ-KVAAJVFYSA-N
Data  1 IC50
  Tab Delimited (TSV)   2D SDfile   Computed 3D by Vconf -m prep SDfile
Find this compound or compounds like it in BindingDB:
Activity Spreadsheet -- Enzyme Inhibition Constant Data from BindingDB
Found 1 hit for monomerid = 50122119
TargetGlucagon receptor(Homo sapiens (Human))
Novo Nordisk
Curated by ChEMBL
LigandPNGBDBM50122119(3-Chloro-4-hydroxy-benzoic acid {4-[2-(4-trifluoro...)
Affinity DataIC50:  27.7nM. Assay description: In vitro binding affinity for recombinant human glucagon receptor (hGGR) in BHK cells
In DepthDetails ArticlePubMed