BDBM50122127 3-Chloro-4-hydroxy-benzoic acid (4-{2-[2-(4-bromo-phenyl)-ethylamino]-ethoxy}-naphthalen-1-ylmethylene)-hydrazide::CHEMBL152409
SMILES Oc1ccc(cc1Cl)C(=O)N\N=C\c1ccc(OCCNCCc2ccc(Br)cc2)c2ccccc12
InChI Key InChIKey=KYTDHUVNLKVTCA-KCSSXMTESA-N
Data  1 IC50
  Tab Delimited (TSV)   2D SDfile   Computed 3D by Vconf -m prep SDfile
Find this compound or compounds like it in BindingDB:
Activity Spreadsheet -- Enzyme Inhibition Constant Data from BindingDB
Found 1 hit for monomerid = 50122127
TargetGlucagon receptor(Homo sapiens (Human))
Novo Nordisk
Curated by ChEMBL
LigandPNGBDBM50122127(3-Chloro-4-hydroxy-benzoic acid (4-{2-[2-(4-bromo-...)
Affinity DataIC50:  19.7nM. Assay description: In vitro binding affinity for recombinant human glucagon receptor (hGGR) in BHK cells
In DepthDetails ArticlePubMed