BDBM50122135 3-Chloro-4-hydroxy-benzoic acid [1-(2,3,5,6-tetramethyl-benzyl)-1H-indol-4-ylmethylene]-hydrazide::CHEMBL153157
SMILES Cc1cc(C)c(C)c(Cn2ccc3c(\C=N\NC(=O)c4ccc(O)c(Cl)c4)cccc23)c1C
InChI Key InChIKey=LSELQPPLNRLWOX-IPPBACCNSA-N
Data  1 IC50
  Tab Delimited (TSV)   2D SDfile   Computed 3D by Vconf -m prep SDfile
Find this compound or compounds like it in BindingDB:
Activity Spreadsheet -- Enzyme Inhibition Constant Data from BindingDB
Found 1 hit for monomerid = 50122135
TargetGlucagon receptor(Homo sapiens (Human))
Novo Nordisk
Curated by ChEMBL
LigandPNGBDBM50122135(3-Chloro-4-hydroxy-benzoic acid [1-(2,3,5,6-tetram...)
Affinity DataIC50:  5.30nM. Assay description: In vitro binding affinity for recombinant human glucagon receptor (hGGR) in BHK cells
In DepthDetails ArticlePubMed