BDBM50122149 3-Cyano-4-hydroxy-benzoic acid [1-(4-trifluoromethyl-benzyl)-1H-indol-4-ylmethylene]-hydrazide::CHEMBL345713
SMILES Oc1ccc(cc1C#N)C(=O)N\N=C\c1cccc2n(Cc3ccc(cc3)C(F)(F)F)ccc12
InChI Key InChIKey=HFPOQOQBQMPPBL-AMVVHIIESA-N
Data  1 IC50
  Tab Delimited (TSV)   2D SDfile   Computed 3D by Vconf -m prep SDfile
Find this compound or compounds like it in BindingDB:
Activity Spreadsheet -- Enzyme Inhibition Constant Data from BindingDB
Found 1 hit for monomerid = 50122149
TargetGlucagon receptor(Homo sapiens (Human))
Novo Nordisk
Curated by ChEMBL
LigandPNGBDBM50122149(3-Cyano-4-hydroxy-benzoic acid [1-(4-trifluorometh...)
Affinity DataIC50:  22.3nM. Assay description: In vitro binding affinity for recombinant human glucagon receptor (hGGR) in BHK cells
In DepthDetails ArticlePubMed