BDBM50122619 CHEMBL3623107
SMILES COc1ccc(\C=C\c2ccccc2N2C(=O)c3ccccc3C2=O)cc1OC
InChI Key InChIKey=MKFOSSOUEAENMG-ACCUITESSA-N
Data  4 IC50
  Tab Delimited (TSV)   2D SDfile   Computed 3D by Vconf -m prep SDfile
Find this compound or compounds like it in BindingDB:
Activity Spreadsheet -- Enzyme Inhibition Constant Data from BindingDB
Found 4 hits for monomerid = 50122619
TargetOxysterols receptor LXR-alpha(Homo sapiens (Human))
The University Of Tokyo
Curated by ChEMBL
LigandPNGBDBM50122619(CHEMBL3623107)
Affinity DataIC50:  3.30E+3nM. Assay description: Antagonist activity at human LXR-alpha transfected in HEK293 cells after 16 hrs by luciferase reporter gene assay in presence of 0.3 uM N-(4-(1,1,1,3...
In DepthDetails ArticlePubMed
TargetOxysterols receptor LXR-alpha/LXR-beta(Homo sapiens (Human))
The University Of Tokyo
Curated by ChEMBL
LigandPNGBDBM50122619(CHEMBL3623107)
Affinity DataIC50:  1.50E+3nM. Assay description: Transrepression activity of LXR in human THP1 cells assessed as inhibition of LPS-induced IL-6 level after 18 hrs by ELISA
In DepthDetails ArticlePubMed
TargetOxysterols receptor LXR-beta(Homo sapiens (Human))
The University Of Tokyo
Curated by ChEMBL
LigandPNGBDBM50122619(CHEMBL3623107)
Affinity DataIC50:  1.80E+3nM. Assay description: Binding affinity to LXR-beta ligand binding domain (unknown origin) by TR-FRET assay in presence of 0.1 uM agonist N-(4-(1,1,1,3,3,3-hexafluoro-2-hyd...
In DepthDetails ArticlePubMed
TargetOxysterols receptor LXR-beta(Homo sapiens (Human))
The University Of Tokyo
Curated by ChEMBL
LigandPNGBDBM50122619(CHEMBL3623107)
Affinity DataIC50:  4.30E+3nM. Assay description: Antagonist activity at human LXR-beta transfected in HEK293 cells after 16 hrs by luciferase reporter gene assay in presence of 0.1 uM N-(4-(1,1,1,3,...
In DepthDetails ArticlePubMed