BDBM50123395 (S)-1-(4-{2-[Bis-(4-fluoro-phenyl)-methoxy]-ethyl}-piperazin-1-yl)-3-phenyl-propan-2-ol; compound with bis (E)-but-2-enedioic acid::CHEMBL153329
SMILES O[C@H](CN1CCN(CCOC(c2ccc(F)cc2)c2ccc(F)cc2)CC1)Cc1ccccc1
InChI Key InChIKey=GJDQYWYMCFMZIM-MHZLTWQESA-N
Data  2 KI
  Tab Delimited (TSV)   2D SDfile   Computed 3D by Vconf -m prep SDfile
Find this compound or compounds like it in BindingDB:
Activity Spreadsheet -- Enzyme Inhibition Constant Data from BindingDB
Found 2 hits for monomerid = 50123395
TargetSodium-dependent dopamine transporter(Rattus norvegicus (rat))
National Institute Of Diabetes And Digestive And Kidney Diseases
Curated by ChEMBL
LigandPNGBDBM50123395((S)-1-(4-{2-[Bis-(4-fluoro-phenyl)-methoxy]-ethyl}...)
Affinity DataKi:  0.75nM. Assay description: Binding affinity for dopamine transporter (DAT)
In DepthDetails ArticlePubMed
TargetSodium-dependent serotonin transporter(Rattus norvegicus (rat))
National Institute Of Diabetes And Digestive And Kidney Diseases
Curated by ChEMBL
LigandPNGBDBM50123395((S)-1-(4-{2-[Bis-(4-fluoro-phenyl)-methoxy]-ethyl}...)
Affinity DataKi:  230nM. Assay description: Binding affinity for serotonin transporter (SERT)
In DepthDetails ArticlePubMed