BDBM50123495 2-[3-(2,2-Difluoro-2-phenyl-ethylamino)-6-methyl-2-oxo-2H-pyrazin-1-yl]-N-(3-fluoro-4-methyl-pyridin-2-ylmethyl)-acetamide::CHEMBL341909
SMILES Cc1ccnc(CNC(=O)Cn2c(C)cnc(NCC(F)(F)c3ccccc3)c2=O)c1F
InChI Key InChIKey=ISVTWMHMTZONOV-UHFFFAOYSA-N
Data  2 KI
  Tab Delimited (TSV)   2D SDfile   Computed 3D by Vconf -m prep SDfile
Find this compound or compounds like it in BindingDB:
Activity Spreadsheet -- Enzyme Inhibition Constant Data from BindingDB
Found 2 hits for monomerid = 50123495
TargetProthrombin(Homo sapiens (Human))
Merck Research Laboratories
Curated by ChEMBL
LigandPNGBDBM50123495(2-[3-(2,2-Difluoro-2-phenyl-ethylamino)-6-methyl-2...)
Affinity DataKi:  1.20nM. Assay description: Inhibitory constant against thrombin (IIa)
In DepthDetails ArticlePubMed
TargetSerine protease 1(Homo sapiens (Human))
Merck Research Laboratories
Curated by ChEMBL
LigandPNGBDBM50123495(2-[3-(2,2-Difluoro-2-phenyl-ethylamino)-6-methyl-2...)
Affinity DataKi:  4.00E+4nM. Assay description: Inhibitory constant against human trypsin
In DepthDetails ArticlePubMed