BDBM50123621 6-[3-amino-(3S)-tetrahydro-1H-1-pyrrolyl]-5-fluoro-3-oxo-3H-naphtho[2,1-b]pyrido[3,2,1-kl]phenoxazine-2-carboxylic acid::CHEMBL154276
SMILES N[C@H]1CCN(C1)c1c(F)cc2c3c1oc1cc4c(ccc5ccccc45)cc1n3cc(C(O)=O)c2=O
InChI Key InChIKey=QYQUMHWYIJBNPE-INIZCTEOSA-N
Data  1 IC50
  Tab Delimited (TSV)   2D SDfile   Computed 3D by Vconf -m prep SDfile
Find this compound or compounds like it in BindingDB:
Activity Spreadsheet -- Enzyme Inhibition Constant Data from BindingDB
Found 1 hit for monomerid = 50123621
TargetDNA polymerase I, thermostable(Thermus aquaticus)
The University Of Arizona
Curated by ChEMBL
LigandPNGBDBM50123621(6-[3-amino-(3S)-tetrahydro-1H-1-pyrrolyl]-5-fluoro...)
Affinity DataIC50:  5.70E+3nM. Assay description: Inhibition of Taq DNA polymerase
In DepthDetails ArticlePubMed