BDBM50123792 3-[(4-Aminomethyl-2-carboxymethyl-phenylcarbamoyl)-methyl]-7-chloro-1,3,4,5-tetrahydro-benzo[cd]indole-2-carboxylic acid::CHEMBL350974
SMILES NCc1ccc(NC(=O)C[C@@H]2CCc3cc(Cl)cc4[nH]c(C(O)=O)c2c34)c(CC(O)=O)c1
InChI Key InChIKey=IEFCEOQWXAGOBM-ZDUSSCGKSA-N
Data  1 IC50
  Tab Delimited (TSV)   2D SDfile   Computed 3D by Vconf -m prep SDfile
Find this compound or compounds like it in BindingDB:
Activity Spreadsheet -- Enzyme Inhibition Constant Data from BindingDB
Found 1 hit for monomerid = 50123792
TargetGlutamate receptor ionotropic, NMDA 1(RAT)
Sumitomo Pharmaceuticals
Curated by ChEMBL
LigandPNGBDBM50123792(3-[(4-Aminomethyl-2-carboxymethyl-phenylcarbamoyl)...)
Affinity DataIC50:  1.5nM. Assay description: Affinity for glycine site of N-methyl-D-aspartate glutamate receptor determined by displacement of tritium labeled selective glycine antagonist [3H]-...
In DepthDetails ArticlePubMed