BDBM50124292 3-[28-(4-phosphonooxy-benzyl)-7-carbamoyl-22-carbamoylmethyl-25-(2-carboxyethyl)-10-(4-hydroxybenzyl)-31-isobutyl-19-isopropyl-13-(2-methylsulfanylethyl)-3,9,12,15,18,21,24,27,30,33-decaoxo-5-thia-2,8,11,14,17,20,23,26,29,32-decaazacyclotritriacontanyl]propanoic acid::CHEMBL264809
SMILES CSCC[C@@H]1NC(=O)CNC(=O)[C@@H](NC(=O)[C@H](CC(N)=O)NC(=O)[C@H](CCC(O)=O)NC(=O)[C@H](Cc2ccc(OP(O)(O)=O)cc2)NC(=O)[C@H](CC(C)C)NC(=O)[C@H](CCC(O)=O)NC(=O)CSC[C@H](NC(=O)[C@H](Cc2ccc(O)cc2)NC1=O)C(N)=O)C(C)C
InChI Key InChIKey=LQKBCUCHZJQOJO-AGEHIQCHSA-N
Data  1 IC50
  Tab Delimited (TSV)   2D SDfile   Computed 3D by Vconf -m prep SDfile
Find this compound or compounds like it in BindingDB:
Activity Spreadsheet -- Enzyme Inhibition Constant Data from BindingDB
Found 1 hit for monomerid = 50124292
TargetGrowth factor receptor-bound protein 2(Homo sapiens (Human))
National Cancer Institute-Frederick
Curated by ChEMBL
LigandPNGBDBM50124292(3-[28-(4-phosphonooxy-benzyl)-7-carbamoyl-22-carba...)
Affinity DataIC50:  137nM. Assay description: Inhibition of Growth factor receptor-bound protein 2 (Grb2) SH2 domain binding by ELISA
In DepthDetails ArticlePubMed