BDBM50124297 3-[4-(4-phosphonooxybenzyl)-17-carbamoyl-32-carbamoylmethyl-20-(4-hydroxybenzyl)-7-isobutyl-29-isopropyl-10-methyl-23-(2-methylsulfanylethyl)-3,6,9,12,19,22,25,28,31,34-decaoxo-14-thia-2,5,8,11,18,21,24,27,30,33-decaazacyclotetratriacontanyl]propanoic acid::CHEMBL2371606
SMILES CSCC[C@@H]1NC(=O)CNC(=O)[C@@H](NC(=O)[C@H](CC(N)=O)NC(=O)[C@H](CCC(O)=O)NC(=O)[C@H](Cc2ccc(OP(O)(O)=O)cc2)NC(=O)[C@H](CC(C)C)NC(=O)[C@H](C)NC(=O)CSCC[C@H](NC(=O)[C@H](Cc2ccc(O)cc2)NC1=O)C(N)=O)C(C)C
InChI Key InChIKey=KFDLTASOKXPTHK-OVKCSXIMSA-N
Data  1 IC50
  Tab Delimited (TSV)   2D SDfile   Computed 3D by Vconf -m prep SDfile
Find this compound or compounds like it in BindingDB:
Activity Spreadsheet -- Enzyme Inhibition Constant Data from BindingDB
Found 1 hit for monomerid = 50124297
TargetGrowth factor receptor-bound protein 2(Homo sapiens (Human))
National Cancer Institute-Frederick
Curated by ChEMBL
LigandPNGBDBM50124297(3-[4-(4-phosphonooxybenzyl)-17-carbamoyl-32-carbam...)
Affinity DataIC50:  55nM. Assay description: Inhibition of Growth factor receptor-bound protein 2 (Grb2) SH2 domain binding by ELISA
In DepthDetails ArticlePubMed