BDBM50124524 2-Phenyl-1,2-dihydro-quinazolin-4-ylamine::2-phenyl-1,2-dihydroquinazolin-4-amine::CHEMBL174481
SMILES NC1=NC(Nc2ccccc12)c1ccccc1
InChI Key InChIKey=VRHGJUOMOHIJKK-UHFFFAOYSA-N
Data  2 IC50
  Tab Delimited (TSV)   2D SDfile   Computed 3D by Vconf -m prep SDfile
Find this compound or compounds like it in BindingDB:
Activity Spreadsheet -- Enzyme Inhibition Constant Data from BindingDB
Found 2 hits for monomerid = 50124524
TargetNitric oxide synthase, inducible(Homo sapiens (Human))
Novartis Institutes For Biomedical Research
Curated by ChEMBL
LigandPNGBDBM50124524(2-Phenyl-1,2-dihydro-quinazolin-4-ylamine | 2-phen...)
Affinity DataIC50:  2.50E+3nM. Assay description: Inhibition of iNOS
In DepthDetails ArticlePubMed
TargetNitric oxide synthase, inducible(Homo sapiens (Human))
Novartis Institutes For Biomedical Research
Curated by ChEMBL
LigandPNGBDBM50124524(2-Phenyl-1,2-dihydro-quinazolin-4-ylamine | 2-phen...)
Affinity DataIC50:  2.50E+3nM. Assay description: Inhibitory activity of compound against human inducible nitiric oxide synthase
In DepthDetails ArticlePubMed