BDBM50124531 4-[4'-amino-5'-fluorospiro[hexahydropyridine-4,2'-(1',2'-dihydroquinazoline)]-1-ylcarbonyl]benzonitrile::CHEMBL367556
SMILES NC1=NC2(CCN(CC2)C(=O)c2ccc(cc2)C#N)Nc2cccc(F)c12
InChI Key InChIKey=GROLIDJOEMLLED-UHFFFAOYSA-N
Data  2 IC50
  Tab Delimited (TSV)   2D SDfile   Computed 3D by Vconf -m prep SDfile
Find this compound or compounds like it in BindingDB:
Activity Spreadsheet -- Enzyme Inhibition Constant Data from BindingDB
Found 2 hits for monomerid = 50124531
TargetNitric oxide synthase, brain(Homo sapiens (Human))
Astrazeneca R&D Charnwood
Curated by ChEMBL
LigandPNGBDBM50124531(4-[4'-amino-5'-fluorospiro[hexahydropyridine-4,2'-...)
Affinity DataIC50:  1.20E+4nM. Assay description: Inhibitory activity against human neuronal nitiric oxide synthase
In DepthDetails ArticlePubMed
TargetNitric oxide synthase, inducible(Homo sapiens (Human))
Astrazeneca R&D Charnwood
Curated by ChEMBL
LigandPNGBDBM50124531(4-[4'-amino-5'-fluorospiro[hexahydropyridine-4,2'-...)
Affinity DataIC50:  27nM. Assay description: Inhibitory activity of compound against human inducible nitiric oxide synthase
In DepthDetails ArticlePubMed