BDBM50124534 2-Methyl-1,2-dihydro-quinazolin-4-ylamine::2-methyl-1,2-dihydroquinazolin-4-amine::CHEMBL355856
SMILES CC1Nc2ccccc2C(N)=N1
InChI Key InChIKey=BFASSLCZFJPKRD-UHFFFAOYSA-N
Data  2 IC50
  Tab Delimited (TSV)   2D SDfile   Computed 3D by Vconf -m prep SDfile
Find this compound or compounds like it in BindingDB:
Activity Spreadsheet -- Enzyme Inhibition Constant Data from BindingDB
Found 2 hits for monomerid = 50124534
TargetNitric oxide synthase, inducible(Homo sapiens (Human))
Novartis Institutes For Biomedical Research
Curated by ChEMBL
LigandPNGBDBM50124534(2-Methyl-1,2-dihydro-quinazolin-4-ylamine | 2-meth...)
Affinity DataIC50:  9.80E+3nM. Assay description: Inhibition of iNOS
In DepthDetails ArticlePubMed
TargetNitric oxide synthase, inducible(Homo sapiens (Human))
Novartis Institutes For Biomedical Research
Curated by ChEMBL
LigandPNGBDBM50124534(2-Methyl-1,2-dihydro-quinazolin-4-ylamine | 2-meth...)
Affinity DataIC50:  9.80E+3nM. Assay description: Inhibitory activity of compound against human inducible nitiric oxide synthase
In DepthDetails ArticlePubMed