BDBM50124539 2-Cyclopropyl-1,2-dihydro-quinazolin-4-ylamine::CHEMBL173920
SMILES NC1=NC(Nc2ccccc12)C1CC1
InChI Key InChIKey=MXQUJZRTIGEIOF-UHFFFAOYSA-N
Data  1 IC50
  Tab Delimited (TSV)   2D SDfile   Computed 3D by Vconf -m prep SDfile
Find this compound or compounds like it in BindingDB:
Activity Spreadsheet -- Enzyme Inhibition Constant Data from BindingDB
Found 1 hit for monomerid = 50124539
TargetNitric oxide synthase, inducible(Homo sapiens (Human))
Astrazeneca R&D Charnwood
Curated by ChEMBL
LigandPNGBDBM50124539(2-Cyclopropyl-1,2-dihydro-quinazolin-4-ylamine | C...)
Affinity DataIC50:  1.10E+3nM. Assay description: Inhibitory activity of compound against human inducible nitiric oxide synthase
In DepthDetails ArticlePubMed