BDBM50124718 (4R,5S,6S,7R)-1-(3-Amino-1H-indazol-5-ylmethyl)-3-benzyl-5,6-dihydroxy-4,7-bis-(3-methyl-benzyl)-[1,3]diazepan-2-one::CHEMBL348543
SMILES Cc1cccc(C[C@@H]2[C@H](O)[C@@H](O)[C@@H](Cc3cccc(C)c3)N(Cc3ccc4[nH]nc(N)c4c3)C(=O)N2Cc2ccccc2)c1
InChI Key InChIKey=NBQYBSPBXGGPQZ-WZJLIZBTSA-N
Data  1 KI
  Tab Delimited (TSV)   2D SDfile   Computed 3D by Vconf -m prep SDfile
Find this compound or compounds like it in BindingDB:
Activity Spreadsheet -- Enzyme Inhibition Constant Data from BindingDB
Found 1 hit for monomerid = 50124718
TargetGag-Pol polyprotein [489-587](Human immunodeficiency virus type 1)
Bristol-Myers Squibb
Curated by ChEMBL
LigandPNGBDBM50124718((4R,5S,6S,7R)-1-(3-Amino-1H-indazol-5-ylmethyl)-3-...)
Affinity DataKi:  0.0620nM. Assay description: Binding affinity of the compound against HIV-Protease was determined
In DepthDetails ArticlePubMed