BDBM50124913 CHEMBL160013::N-(4-Methoxy-benzyl)-4-trifluoromethoxy-benzamidine
SMILES COc1ccc(CN=C(N)c2ccc(OC(F)(F)F)cc2)cc1
InChI Key InChIKey=GVURXRWNLBAMGJ-UHFFFAOYSA-N
Data  1 KI
  Tab Delimited (TSV)   2D SDfile   Computed 3D by Vconf -m prep SDfile
Find this compound or compounds like it in BindingDB:
Activity Spreadsheet -- Enzyme Inhibition Constant Data from BindingDB
Found 1 hit for monomerid = 50124913
TargetGlutamate receptor ionotropic, NMDA 2B(Homo sapiens (Human))
Merck Research Laboratories
Curated by ChEMBL
LigandPNGBDBM50124913(CHEMBL160013 | N-(4-Methoxy-benzyl)-4-trifluoromet...)
Affinity DataKi:  1.10E+3nM. Assay description: Displacement of NMDA receptor-specific [3H]-ifenprodil binding to recombinant human NMDA receptor, NR2B subtype expressed in L cells
In DepthDetails ArticlePubMed