BDBM50127872 3-((1R,2R,3S,5S)-6-Methoxy-2,2-dimethyl-tetrahydro-furo[2,3-d][1,3]dioxol-5-yl)-4,5-dihydro-isoxazole-5-carboxylic acid (2'-sulfamoyl-biphenyl-4-yl)-amide::CHEMBL51565
SMILES CO[C@@H]1[C@H]2OC(C)(C)O[C@H]2O[C@H]1C1=NOC(C1)C(=O)Nc1ccc(cc1)-c1ccccc1S(N)(=O)=O
InChI Key InChIKey=IRIZIXJMLPYTOY-UWLYUPEASA-N
Data  1 KI
  Tab Delimited (TSV)   2D SDfile   Computed 3D by Vconf -m prep SDfile
Find this compound or compounds like it in BindingDB:
Activity Spreadsheet -- Enzyme Inhibition Constant Data from BindingDB
Found 1 hit for monomerid = 50127872
TargetCoagulation factor X(Homo sapiens (Human))
Bristol-Myers Squibb
Curated by ChEMBL
LigandPNGBDBM50127872(3-((1R,2R,3S,5S)-6-Methoxy-2,2-dimethyl-tetrahydro...)
Affinity DataKi: >3.00E+4nM. Assay description: Binding affinity against the Factor Xa (FXa)
In DepthDetails ArticlePubMed