BDBM50127876 3-(3-Hydroxy-phenyl)-4,5-dihydro-isoxazole-5-carboxylic acid (2'-sulfamoyl-biphenyl-4-yl)-amide::CHEMBL296508
SMILES NS(=O)(=O)c1ccccc1-c1ccc(NC(=O)C2CC(=NO2)c2cccc(O)c2)cc1
InChI Key InChIKey=ZGAATMJAVJOTIL-UHFFFAOYSA-N
Data  1 KI
  Tab Delimited (TSV)   2D SDfile   Computed 3D by Vconf -m prep SDfile
Find this compound or compounds like it in BindingDB:
Activity Spreadsheet -- Enzyme Inhibition Constant Data from BindingDB
Found 1 hit for monomerid = 50127876
TargetCoagulation factor X(Homo sapiens (Human))
Bristol-Myers Squibb
Curated by ChEMBL
LigandPNGBDBM50127876(3-(3-Hydroxy-phenyl)-4,5-dihydro-isoxazole-5-carbo...)
Affinity DataKi: >3.00E+3nM. Assay description: Binding affinity against the Factor Xa (FXa)
In DepthDetails ArticlePubMed