BDBM50127887 3-(4-Iodo-phenyl)-4,5-dihydro-isoxazole-5-carboxylic acid (2'-sulfamoyl-biphenyl-4-yl)-amide::CHEMBL53405
SMILES NS(=O)(=O)c1ccccc1-c1ccc(NC(=O)C2CC(=NO2)c2ccc(I)cc2)cc1
InChI Key InChIKey=FRWUUPSDYOUVPY-UHFFFAOYSA-N
Data  1 KI
  Tab Delimited (TSV)   2D SDfile   Computed 3D by Vconf -m prep SDfile
Find this compound or compounds like it in BindingDB:
Activity Spreadsheet -- Enzyme Inhibition Constant Data from BindingDB
Found 1 hit for monomerid = 50127887
TargetCoagulation factor X(Homo sapiens (Human))
Bristol-Myers Squibb
Curated by ChEMBL
LigandPNGBDBM50127887(3-(4-Iodo-phenyl)-4,5-dihydro-isoxazole-5-carboxyl...)
Affinity DataKi:  1.90E+3nM. Assay description: Binding affinity of the compound against the coagulation factor X
In DepthDetails ArticlePubMed