BDBM50127897 3-((E)-1-Phenyl-but-1-enyl)-4,5-dihydro-isoxazole-5-carboxylic acid (2'-sulfamoyl-biphenyl-4-yl)-amide::CHEMBL416834
SMILES CC\C=C(\C1=NOC(C1)C(=O)Nc1ccc(cc1)-c1ccccc1S(N)(=O)=O)c1ccccc1
InChI Key InChIKey=XQLRHYYSOWPDHC-ODCIPOBUSA-N
Data  1 KI
  Tab Delimited (TSV)   2D SDfile   Computed 3D by Vconf -m prep SDfile
Find this compound or compounds like it in BindingDB:
Activity Spreadsheet -- Enzyme Inhibition Constant Data from BindingDB
Found 1 hit for monomerid = 50127897
TargetCoagulation factor X(Homo sapiens (Human))
Bristol-Myers Squibb
Curated by ChEMBL
LigandPNGBDBM50127897(3-((E)-1-Phenyl-but-1-enyl)-4,5-dihydro-isoxazole-...)
Affinity DataKi:  2.40E+4nM. Assay description: Binding affinity against the Factor Xa (FXa)
In DepthDetails ArticlePubMed