BDBM50127900 3-(4-Chloro-benzo[1,3]dioxol-5-yl)-4,5-dihydro-isoxazole-5-carboxylic acid (2'-sulfamoyl-biphenyl-4-yl)-amide::CHEMBL295487
SMILES NS(=O)(=O)c1ccccc1-c1ccc(NC(=O)C2CC(=NO2)c2ccc3OCOc3c2Cl)cc1
InChI Key InChIKey=VZRXQEBFEMILLZ-UHFFFAOYSA-N
Data  1 KI
  Tab Delimited (TSV)   2D SDfile   Computed 3D by Vconf -m prep SDfile
Find this compound or compounds like it in BindingDB:
Activity Spreadsheet -- Enzyme Inhibition Constant Data from BindingDB
Found 1 hit for monomerid = 50127900
TargetCoagulation factor X(Homo sapiens (Human))
Bristol-Myers Squibb
Curated by ChEMBL
LigandPNGBDBM50127900(3-(4-Chloro-benzo[1,3]dioxol-5-yl)-4,5-dihydro-iso...)
Affinity DataKi:  1.70E+3nM. Assay description: Binding affinity against the Factor Xa (FXa)
In DepthDetails ArticlePubMed