BDBM50127913 3-Pentyl-4,5-dihydro-isoxazole-5-carboxylic acid (2'-sulfamoyl-biphenyl-4-yl)-amide::CHEMBL52064
SMILES CCCCCC1=NOC(C1)C(=O)Nc1ccc(cc1)-c1ccccc1S(N)(=O)=O
InChI Key InChIKey=TYJRDDMZYMNGAZ-UHFFFAOYSA-N
Data  1 KI
  Tab Delimited (TSV)   2D SDfile   Computed 3D by Vconf -m prep SDfile
Find this compound or compounds like it in BindingDB:
Activity Spreadsheet -- Enzyme Inhibition Constant Data from BindingDB
Found 1 hit for monomerid = 50127913
TargetCoagulation factor X(Homo sapiens (Human))
Bristol-Myers Squibb
Curated by ChEMBL
LigandPNGBDBM50127913(3-Pentyl-4,5-dihydro-isoxazole-5-carboxylic acid (...)
Affinity DataKi:  4.50E+3nM. Assay description: Binding affinity of the compound against the coagulation factor X
In DepthDetails ArticlePubMed