BDBM50127941 (S)-3-(2-{6-Ethyl-2-oxo-3-[(5,6,7,8-tetrahydro-[1,8]naphthyridin-2-ylmethyl)-amino]-2H-pyrazin-1-yl}-acetylamino)-3-(3-fluoro-phenyl)-propionic acid::CHEMBL54259
SMILES CCc1cnc(NCc2ccc3CCCNc3n2)c(=O)n1CC(=O)N[C@@H](CC(O)=O)c1cccc(F)c1
InChI Key InChIKey=XGBKKOOTEJXBQX-NRFANRHFSA-N
Data  2 IC50
  Tab Delimited (TSV)   2D SDfile   Computed 3D by Vconf -m prep SDfile
Find this compound or compounds like it in BindingDB:
Activity Spreadsheet -- Enzyme Inhibition Constant Data from BindingDB
Found 2 hits for monomerid = 50127941
TargetIntegrin alpha-V/beta-3(Homo sapiens (Human))
Merck Research Laboratories
Curated by ChEMBL
LigandPNGBDBM50127941((S)-3-(2-{6-Ethyl-2-oxo-3-[(5,6,7,8-tetrahydro-[1,...)
Affinity DataIC50:  1.90nM. Assay description: Ability to bind to the Alpha 2 Beta 3 integrin expressed as inhibitory concentration against ADP-stimulated aggregation of human gel-filtered platele...
In DepthDetails ArticlePubMed
TargetIntegrin alpha-IIb/beta-3(Homo sapiens (Human))
Merck Research Laboratories
Curated by ChEMBL
LigandPNGBDBM50127941((S)-3-(2-{6-Ethyl-2-oxo-3-[(5,6,7,8-tetrahydro-[1,...)
Affinity DataIC50: >3.00E+3nM. Assay description: Ability to bind to the Alpha 2 Beta 3 integrin expressed as inhibitory concentration against ADP-stimulated aggregation of human gel-filtered platele...
In DepthDetails ArticlePubMed