BDBM50128067 (2E)-N-ALLYL-4-{[3-(4-BROMOPHENYL)-5-FLUORO-1-METHYL-1H-INDAZOL-6-YL]OXY}-N-METHYL-2-BUTEN-1-AMINE::(E)-N-allyl-4-(3-(4-bromophenyl)-5-fluoro-1-methyl-1H-indazol-6-yloxy)-N-methylbut-2-en-1-aminium::Allyl-{4-[3-(4-bromo-phenyl)-5-fluoro-1-methyl-1H-indazol-6-yloxy]-but-2-enyl}-methyl-amine::CHEMBL65730
SMILES CN(CC=C)C\C=C\COc1cc2n(C)nc(-c3ccc(Br)cc3)c2cc1F
InChI Key InChIKey=YDWPQZUWZDRRSE-AATRIKPKSA-N
Data  3 IC50
PDB links: 1 PDB ID matches this monomer.
  Tab Delimited (TSV)   2D SDfile   Computed 3D by Vconf -m prep SDfile
Find this compound or compounds like it in BindingDB:
Activity Spreadsheet -- Enzyme Inhibition Constant Data from BindingDB
Found 3 hits for monomerid = 50128067
TargetLanosterol synthase(Homo sapiens (Human))
Albert-Ludwigs-University Of Freiburg
Curated by ChEMBL
LigandPNGBDBM50128067((2E)-N-ALLYL-4-{[3-(4-BROMOPHENYL)-5-FLUORO-1-METH...)
Affinity DataIC50:  29nM. Assay description: Inhibitory activity against Oxidosqualene-lanosterol cyclase from human liver microsomes
In DepthDetails ArticlePubMed
TargetLanosterol synthase(Homo sapiens (Human))
Albert-Ludwigs-University Of Freiburg
Curated by ChEMBL
LigandPNGBDBM50128067((2E)-N-ALLYL-4-{[3-(4-BROMOPHENYL)-5-FLUORO-1-METH...)
Affinity DataIC50:  29nM. Assay description: Inhibition of oxidosqualene cyclase
In DepthDetails ArticlePubMed
TargetSqualene--hopene cyclase(Alicyclobacillus acidocaldarius)
Albert-Ludwigs-University Of Freiburg
Curated by ChEMBL
LigandPNGBDBM50128067((2E)-N-ALLYL-4-{[3-(4-BROMOPHENYL)-5-FLUORO-1-METH...)
Affinity DataIC50:  281nM. Assay description: Inhibitory activity against squalene hopene cyclase from Alicyclobacillus acidocaldarius