BDBM50128124 CHEMBL3628105
SMILES Clc1cc(NC(=O)c2occc2-c2ccccc2)ccc1N1C(=O)c2ccccc2C1=O
InChI Key InChIKey=GHPUZYKAMFPMRE-UHFFFAOYSA-N
Data  2 EC50
  Tab Delimited (TSV)   2D SDfile   Computed 3D by Vconf -m prep SDfile
Find this compound or compounds like it in BindingDB:
Activity Spreadsheet -- Enzyme Inhibition Constant Data from BindingDB
Found 2 hits for monomerid = 50128124
TargetMetabotropic glutamate receptor 1(Homo sapiens (Human))
Vanderbilt University
Curated by ChEMBL
LigandPNGBDBM50128124(CHEMBL3628105)
Affinity DataEC50: >1.00E+4nM. Assay description: Positive allosteric modulation of human mGlu1 receptor in HEK293 cells assessed as potentiation of glutamate-induced calcium mobiliztion by Fluo-4AM ...
In DepthDetails ArticlePubMed
TargetMetabotropic glutamate receptor 1(Homo sapiens (Human))
Vanderbilt University
Curated by ChEMBL
LigandPNGBDBM50128124(CHEMBL3628105)
Affinity DataEC50: >1.00E+4nM. Assay description: Positive allosteric modulation of human mGlu1 receptor in HEK293 cells assessed as potentiation of glutamate-induced calcium mobiliztion by Fluo-4AM ...
In DepthDetails ArticlePubMed