BDBM50128127 CHEMBL3628102
SMILES CS(=O)(=O)c1ccc(o1)C(=O)Nc1ccc(N2C(=O)c3ccccc3C2=O)c(Cl)c1
InChI Key InChIKey=JMFPGGHGRTUWNT-UHFFFAOYSA-N
Data  2 EC50
  Tab Delimited (TSV)   2D SDfile   Computed 3D by Vconf -m prep SDfile
Find this compound or compounds like it in BindingDB:
Activity Spreadsheet -- Enzyme Inhibition Constant Data from BindingDB
Found 2 hits for monomerid = 50128127
TargetMetabotropic glutamate receptor 1(Homo sapiens (Human))
Vanderbilt University
Curated by ChEMBL
LigandPNGBDBM50128127(CHEMBL3628102)
Affinity DataEC50: >1.00E+4nM. Assay description: Positive allosteric modulation of human mGlu1 receptor in HEK293 cells assessed as potentiation of glutamate-induced calcium mobiliztion by Fluo-4AM ...
In DepthDetails ArticlePubMed
TargetMetabotropic glutamate receptor 1(Homo sapiens (Human))
Vanderbilt University
Curated by ChEMBL
LigandPNGBDBM50128127(CHEMBL3628102)
Affinity DataEC50: >1.00E+4nM. Assay description: Positive allosteric modulation of human mGlu1 receptor in HEK293 cells assessed as potentiation of glutamate-induced calcium mobiliztion by Fluo-4AM ...
In DepthDetails ArticlePubMed