BDBM50128902 CHEMBL59342::Pyridin-4-ylmethyl-carbamic acid (E)-(2S,3R)-3-hydroxy-2-isobutyrylamino-octadec-4-enyl ester
SMILES CCCCCCCCCCCCC\C=C\[C@@H](O)[C@H](COC(=O)NCc1ccncc1)NC(=O)C(C)C
InChI Key InChIKey=XTWYADQOIICZPU-WKKBHVDPSA-N
Data  1 IC50
  Tab Delimited (TSV)   2D SDfile   Computed 3D by Vconf -m prep SDfile
Find this compound or compounds like it in BindingDB:
Activity Spreadsheet -- Enzyme Inhibition Constant Data from BindingDB
Found 2 hits for monomerid = 50128902
TargetSphingomyelin phosphodiesterase 2(Rattus norvegicus)TBA
LigandPNGBDBM50128902(CHEMBL59342 | Pyridin-4-ylmethyl-carbamic acid (E)...)
Affinity DataIC50:  1.80E+3nM. Assay description: Negative log concentration of antagonist was determined on 5-hydroxytryptamine 2B receptor of Rat stomach fundus
In DepthDetails
TargetSphingomyelin phosphodiesterase 2(Rattus norvegicus)TBA
LigandPNGBDBM50128902(CHEMBL59342 | Pyridin-4-ylmethyl-carbamic acid (E)...)
Affinity DataIC50:  1.80E+3nM. Assay description: Inhibitory concentration against the membrane neutral magnesium-dependent Sphingomyelinase (N-SMase) using rat brain microsomes as the enzyme source
In DepthDetails ArticlePubMed