BDBM50129101 1-(4-Oxazol-5-yl-phenyl)-3-m-tolyl-urea::CHEMBL62232
SMILES Cc1cccc(NC(=O)Nc2ccc(cc2)-c2cnco2)c1
InChI Key InChIKey=AISMDELMNHIKBP-UHFFFAOYSA-N
Data  1 IC50
  Tab Delimited (TSV)   2D SDfile   Computed 3D by Vconf -m prep SDfile
Find this compound or compounds like it in BindingDB:
Activity Spreadsheet -- Enzyme Inhibition Constant Data from BindingDB
Found 1 hit for monomerid = 50129101
TargetInosine-5'-monophosphate dehydrogenase 2(Homo sapiens (Human))
Bristol-Myers Squibb Pharmaceutical Research Institute
Curated by ChEMBL
LigandPNGBDBM50129101(1-(4-Oxazol-5-yl-phenyl)-3-m-tolyl-urea | CHEMBL62...)
Affinity DataIC50:  640nM. Assay description: Inhibition of inosine-5'-monophosphate dehydrogenase 2.
In DepthDetails ArticlePubMed