BDBM50129110 CHEMBL62747::N-{2-[2-(3-Ethyl-4-oxazol-5-yl-phenylamino)-oxazol-5-yl]-phenyl}-N-methyl-2-morpholin-4-yl-acetamide
SMILES CCc1cc(Nc2ncc(o2)-c2ccccc2N(C)C(=O)CN2CCOCC2)ccc1-c1cnco1
InChI Key InChIKey=OQWIWWJQJXRHIU-UHFFFAOYSA-N
Data  1 IC50
  Tab Delimited (TSV)   2D SDfile   Computed 3D by Vconf -m prep SDfile
Find this compound or compounds like it in BindingDB:
Activity Spreadsheet -- Enzyme Inhibition Constant Data from BindingDB
Found 1 hit for monomerid = 50129110
TargetInosine-5'-monophosphate dehydrogenase 2(Homo sapiens (Human))
Bristol-Myers Squibb Pharmaceutical Research Institute
Curated by ChEMBL
LigandPNGBDBM50129110(CHEMBL62747 | N-{2-[2-(3-Ethyl-4-oxazol-5-yl-pheny...)
Affinity DataIC50:  310nM. Assay description: Inhibition of inosine-5'-monophosphate dehydrogenase 2.
In DepthDetails ArticlePubMed