BDBM50129114 2-Oxazol-5-yl-5-(5-phenyl-oxazol-2-ylamino)-phenol::CHEMBL62851
SMILES Oc1cc(Nc2ncc(o2)-c2ccccc2)ccc1-c1cnco1
InChI Key InChIKey=LPAGBGUHZRAGTG-UHFFFAOYSA-N
Data  1 IC50
  Tab Delimited (TSV)   2D SDfile   Computed 3D by Vconf -m prep SDfile
Find this compound or compounds like it in BindingDB:
Activity Spreadsheet -- Enzyme Inhibition Constant Data from BindingDB
Found 1 hit for monomerid = 50129114
TargetInosine-5'-monophosphate dehydrogenase 2(Homo sapiens (Human))
Bristol-Myers Squibb Pharmaceutical Research Institute
Curated by ChEMBL
LigandPNGBDBM50129114(2-Oxazol-5-yl-5-(5-phenyl-oxazol-2-ylamino)-phenol...)
Affinity DataIC50: >1.60E+3nM. Assay description: Inhibition of inosine-5'-monophosphate dehydrogenase 2.
In DepthDetails ArticlePubMed