BDBM50129117 (3-Ethoxy-4-oxazol-5-yl-phenyl)-(5-phenyl-oxazol-2-yl)-amine::CHEMBL62622
SMILES CCOc1cc(Nc2ncc(o2)-c2ccccc2)ccc1-c1cnco1
InChI Key InChIKey=GSHOVVNHCBFGHB-UHFFFAOYSA-N
Data  1 IC50
  Tab Delimited (TSV)   2D SDfile   Computed 3D by Vconf -m prep SDfile
Find this compound or compounds like it in BindingDB:
Activity Spreadsheet -- Enzyme Inhibition Constant Data from BindingDB
Found 1 hit for monomerid = 50129117
TargetInosine-5'-monophosphate dehydrogenase 2(Homo sapiens (Human))
Bristol-Myers Squibb Pharmaceutical Research Institute
Curated by ChEMBL
LigandPNGBDBM50129117((3-Ethoxy-4-oxazol-5-yl-phenyl)-(5-phenyl-oxazol-2...)
Affinity DataIC50: >1.00E+4nM. Assay description: Inhibition of inosine-5'-monophosphate dehydrogenase 2.
In DepthDetails ArticlePubMed