BDBM50129671 Benzoic acid 2-(thiazol-2-ylcarbamoyl)-pyridin-3-yl ester::CHEMBL315270
SMILES O=C(Nc1nccs1)c1ncccc1OC(=O)c1ccccc1
InChI Key InChIKey=FRFLNGYWZCTYKA-UHFFFAOYSA-N
Data  4 IC50
  Tab Delimited (TSV)   2D SDfile   Computed 3D by Vconf -m prep SDfile
Find this compound or compounds like it in BindingDB:
Activity Spreadsheet -- Enzyme Inhibition Constant Data from BindingDB
Found 4 hits for monomerid = 50129671
TargetMethionine aminopeptidase(Escherichia coli (strain K12))
Chinese Academy Of Sciences
Curated by ChEMBL
LigandPNGBDBM50129671(Benzoic acid 2-(thiazol-2-ylcarbamoyl)-pyridin-3-y...)
Affinity DataIC50:  1.22E+3nM. Assay description: Inhibitory concentration against Escherichia coli methionine aminopeptidase 1
In DepthDetails ArticlePubMed
TargetMethionine aminopeptidase 1(Saccharomyces cerevisiae)
Chinese Academy Of Sciences
Curated by ChEMBL
LigandPNGBDBM50129671(Benzoic acid 2-(thiazol-2-ylcarbamoyl)-pyridin-3-y...)
Affinity DataIC50:  1.03E+3nM. Assay description: Inhibitory activity against type I methionine aminopeptidase from Saccharomyces cerevisiae
In DepthDetails ArticlePubMed
TargetMethionine aminopeptidase(Escherichia coli (strain K12))
Chinese Academy Of Sciences
Curated by ChEMBL
LigandPNGBDBM50129671(Benzoic acid 2-(thiazol-2-ylcarbamoyl)-pyridin-3-y...)
Affinity DataIC50:  1.22E+3nM. Assay description: Inhibitory activity against Methionine aminopeptidase 1 from Escherichia coli
In DepthDetails ArticlePubMed
TargetMethionine aminopeptidase 1(Saccharomyces cerevisiae)
Chinese Academy Of Sciences
Curated by ChEMBL
LigandPNGBDBM50129671(Benzoic acid 2-(thiazol-2-ylcarbamoyl)-pyridin-3-y...)
Affinity DataIC50:  1.03E+3nM. Assay description: Inhibitory concentration against Saccharomyces cerevisiae methionine aminopeptidase 1
In DepthDetails ArticlePubMed