BDBM50129862 CHEMBL3629383
SMILES O=Cc1cn2CC(Cn3c4ccccc4c4ccc1c2c34)OCC#N
InChI Key InChIKey=MRMWXHSKVZBHNM-UHFFFAOYSA-N
Data  2 IC50
  Tab Delimited (TSV)   2D SDfile   Computed 3D by Vconf -m prep SDfile
Find this compound or compounds like it in BindingDB:
Activity Spreadsheet -- Enzyme Inhibition Constant Data from BindingDB
Found 2 hits for monomerid = 50129862
TargetSerine/threonine-protein kinase pim-1(Homo sapiens (Human))
Universit£
Curated by ChEMBL
LigandPNGBDBM50129862(CHEMBL3629383)
Affinity DataIC50:  390nM. Assay description: Inhibition of human Pim-1 using RSRHSSYPAGT as substrate measured for 30 mins in presence of [gamma-33P]-ATP
In DepthDetails ArticlePubMed
TargetSerine/threonine-protein kinase pim-3(Homo sapiens (Human))
Universit£
Curated by ChEMBL
LigandPNGBDBM50129862(CHEMBL3629383)
Affinity DataIC50:  190nM. Assay description: Inhibition of human Pim-3 using RSRHSSYPAGT as substrate measured for 30 mins in presence of [gamma-33P]-ATP
In DepthDetails ArticlePubMed