BDBM50130089 7-(2-Chloro-phenyl)-2,3,4,5,11,11a-hexahydro-1H-[1,4]diazepino[1,7-a]indole::CHEMBL311726
SMILES Clc1ccccc1-c1cccc2CC3CCNCCN3c12
InChI Key InChIKey=NGXRAELNXZLHSX-UHFFFAOYSA-N
Data  2 KI
  Tab Delimited (TSV)   2D SDfile   Computed 3D by Vconf -m prep SDfile
Find this compound or compounds like it in BindingDB:
Activity Spreadsheet -- Enzyme Inhibition Constant Data from BindingDB
Found 2 hits for monomerid = 50130089
Target5-hydroxytryptamine receptor 2C(Homo sapiens (Human))
Pharmacia
Curated by ChEMBL
LigandPNGBDBM50130089(7-(2-Chloro-phenyl)-2,3,4,5,11,11a-hexahydro-1H-[1...)
Affinity DataKi:  23nM. Assay description: Binding affinity against 5-hydroxytryptamine 2C receptor using [125I]-DOI radioligand.
In DepthDetails ArticlePubMed
Target5-hydroxytryptamine receptor 2A(Homo sapiens (Human))
Pharmacia
Curated by ChEMBL
LigandPNGBDBM50130089(7-(2-Chloro-phenyl)-2,3,4,5,11,11a-hexahydro-1H-[1...)
Affinity DataKi:  82nM. Assay description: Binding affinity against 5-hydroxytryptamine 2A receptor using [125I]-DOI radioligand.
In DepthDetails ArticlePubMed