BDBM50132188 2-(8-Amino-6-benzylamino-9-isopropyl-9H-purin-2-ylamino)-butan-1-ol::CHEMBL100500
SMILES CCC(CO)Nc1nc(NCc2ccccc2)c2nc(N)n(C(C)C)c2n1
InChI Key InChIKey=MKNYKEVPTYCNNR-UHFFFAOYSA-N
Data  1 IC50
  Tab Delimited (TSV)   2D SDfile   Computed 3D by Vconf -m prep SDfile
Find this compound or compounds like it in BindingDB:
Activity Spreadsheet -- Enzyme Inhibition Constant Data from BindingDB
Found 1 hit for monomerid = 50132188
TargetCyclin-dependent kinase 1(Homo sapiens (Human))
Academy Of Sciences Of The Czech Republic
Curated by ChEMBL
LigandPNGBDBM50132188(2-(8-Amino-6-benzylamino-9-isopropyl-9H-purin-2-yl...)
Affinity DataIC50:  7.00E+4nM. Assay description: Inhibitory concentration against Cyclin dependent kinase 1.
In DepthDetails ArticlePubMed