BDBM50132196 2-(6-Benzylamino-9-isopropyl-8-methyl-9H-purin-2-ylamino)-butan-1-ol::CHEMBL100645
SMILES CCC(CO)Nc1nc(NCc2ccccc2)c2nc(C)n(C(C)C)c2n1
InChI Key InChIKey=FOFJAWWNTDQWJM-UHFFFAOYSA-N
Data  1 IC50
  Tab Delimited (TSV)   2D SDfile   Computed 3D by Vconf -m prep SDfile
Find this compound or compounds like it in BindingDB:
Activity Spreadsheet -- Enzyme Inhibition Constant Data from BindingDB
Found 1 hit for monomerid = 50132196
TargetCyclin-dependent kinase 1(Homo sapiens (Human))
Academy Of Sciences Of The Czech Republic
Curated by ChEMBL
LigandPNGBDBM50132196(2-(6-Benzylamino-9-isopropyl-8-methyl-9H-purin-2-y...)
Affinity DataIC50:  8.00E+3nM. Assay description: Inhibitory concentration against Cyclin dependent kinase 1.
In DepthDetails ArticlePubMed