BDBM50132524 2-(6-Methyl-2-oxo-3-phenylmethanesulfonylamino-2H-pyridin-1-yl)-N-(2-methyl-4,5,6,7-tetrahydro-2H-indazol-5-yl)-acetamide::CHEMBL108458
SMILES Cc1ccc(NS(=O)(=O)Cc2ccccc2)c(=O)n1CC(=O)NC1CCc2nn(C)cc2C1
InChI Key InChIKey=ZYHJZVYDYGLCOB-UHFFFAOYSA-N
Data  3 KI
  Tab Delimited (TSV)   2D SDfile   Computed 3D by Vconf -m prep SDfile
Find this compound or compounds like it in BindingDB:
Activity Spreadsheet -- Enzyme Inhibition Constant Data from BindingDB
Found 3 hits for monomerid = 50132524
TargetProthrombin(Homo sapiens (Human))
University Of Ljubljana
Curated by ChEMBL
LigandPNGBDBM50132524(2-(6-Methyl-2-oxo-3-phenylmethanesulfonylamino-2H-...)
Affinity DataKi:  2.50E+4nM. Assay description: Inhibitory activity against thrombin
In DepthDetails ArticlePubMed
TargetCoagulation factor X(Homo sapiens (Human))
University Of Ljubljana
Curated by ChEMBL
LigandPNGBDBM50132524(2-(6-Methyl-2-oxo-3-phenylmethanesulfonylamino-2H-...)
Affinity DataKi:  9.02E+4nM. Assay description: Inhibitory activity against coagulation factor X
In DepthDetails ArticlePubMed
TargetSerine protease 1(Bos taurus (bovine))
University Of Ljubljana
Curated by ChEMBL
LigandPNGBDBM50132524(2-(6-Methyl-2-oxo-3-phenylmethanesulfonylamino-2H-...)
Affinity DataKi:  8.07E+5nM. Assay description: Inhibitory activity against Trypsin
In DepthDetails ArticlePubMed