BDBM50133429 5-Benzylcarbamoyl-4-(2-chloro-phenyl)-1-ethyl-6-methyl-1,4-dihydro-pyridine-2,3-dicarboxylic acid::CHEMBL326950
SMILES CCN1C(C)=C(C(C(C(O)=O)=C1C(O)=O)c1ccccc1Cl)C(=O)NCc1ccccc1
InChI Key InChIKey=JNAJRKGLPZBMGR-UHFFFAOYSA-N
Data  2 IC50
  Tab Delimited (TSV)   2D SDfile   Computed 3D by Vconf -m prep SDfile
Find this compound or compounds like it in BindingDB:
Activity Spreadsheet -- Enzyme Inhibition Constant Data from BindingDB
Found 2 hits for monomerid = 50133429
TargetGlycogen phosphorylase, muscle form(Homo sapiens (Human))
Merck Research Laboratories
Curated by ChEMBL
LigandPNGBDBM50133429(5-Benzylcarbamoyl-4-(2-chloro-phenyl)-1-ethyl-6-me...)
Affinity DataIC50:  10.6nM. Assay description: In vitro inhibitory activity against human muscle glycogen phosphorylase a (HMGPa)
In DepthDetails ArticlePubMed
TargetGlycogen phosphorylase, liver form(Homo sapiens (Human))
Merck Research Laboratories
Curated by ChEMBL
LigandPNGBDBM50133429(5-Benzylcarbamoyl-4-(2-chloro-phenyl)-1-ethyl-6-me...)
Affinity DataIC50:  10.9nM. Assay description: In vitro inhibitory activity against human liver glycogen phosphorylase a (HLGPa)
In DepthDetails ArticlePubMed