BDBM50133442 4-(2-Chloro-phenyl)-6-methyl-1-(3-nitro-benzyl)-1,4-dihydro-pyridine-2,3,5-tricarboxylic acid 5-isopropyl ester::CHEMBL423509
SMILES CC(C)OC(=O)C1=C(C)N(Cc2cccc(c2)[N+]([O-])=O)C(C(O)=O)=C(C1c1ccccc1Cl)C(O)=O
InChI Key InChIKey=XJFRTXMMZKGJKN-UHFFFAOYSA-N
Data  2 IC50
  Tab Delimited (TSV)   2D SDfile   Computed 3D by Vconf -m prep SDfile
Find this compound or compounds like it in BindingDB:
Activity Spreadsheet -- Enzyme Inhibition Constant Data from BindingDB
Found 2 hits for monomerid = 50133442
TargetGlycogen phosphorylase, liver form(Homo sapiens (Human))
Merck Research Laboratories
Curated by ChEMBL
LigandPNGBDBM50133442(4-(2-Chloro-phenyl)-6-methyl-1-(3-nitro-benzyl)-1,...)
Affinity DataIC50:  5nM. Assay description: In vitro inhibitory activity against human liver glycogen phosphorylase a (HLGPa)
In DepthDetails ArticlePubMed
TargetGlycogen phosphorylase, muscle form(Homo sapiens (Human))
Merck Research Laboratories
Curated by ChEMBL
LigandPNGBDBM50133442(4-(2-Chloro-phenyl)-6-methyl-1-(3-nitro-benzyl)-1,...)
Affinity DataIC50:  10nM. Assay description: In vitro inhibitory activity against human muscle glycogen phosphorylase a (HMGPa)
In DepthDetails ArticlePubMed