BDBM50133527 (S)-1-((R)-2-Amino-3-phenyl-propionyl)-pyrrolidine-2-carboxylic acid 2-(2-amino-ethyl)-5-chloro-benzylamide::CHEMBL118077
SMILES NCCc1ccc(Cl)cc1CNC(=O)[C@@H]1CCCN1C(=O)[C@H](N)Cc1ccccc1
InChI Key InChIKey=WWIRSTJWBDUGLV-RTWAWAEBSA-N
Data  2 KI
  Tab Delimited (TSV)   2D SDfile   Computed 3D by Vconf -m prep SDfile
Find this compound or compounds like it in BindingDB:
Activity Spreadsheet -- Enzyme Inhibition Constant Data from BindingDB
Found 2 hits for monomerid = 50133527
TargetProthrombin(Homo sapiens (Human))
Merck Research Laboratories
Curated by ChEMBL
LigandPNGBDBM50133527((S)-1-((R)-2-Amino-3-phenyl-propionyl)-pyrrolidine...)
Affinity DataKi:  62nM. Assay description: Inhibitory constant evaluated against thrombin (Factor IIa)
In DepthDetails ArticlePubMed
TargetSerine protease 1(Homo sapiens (Human))
Merck Research Laboratories
Curated by ChEMBL
LigandPNGBDBM50133527((S)-1-((R)-2-Amino-3-phenyl-propionyl)-pyrrolidine...)
Affinity DataKi:  2.52E+5nM. Assay description: Inhibitory constant evaluated against trypsin
In DepthDetails ArticlePubMed