BDBM50133714 CHEMBL327031::N-{3-[2-(3-Cyano-1-methyl-1H-indol-6-ylamino)-oxazol-5-yl]-phenyl}-benzamide
SMILES Cn1cc(C#N)c2ccc(Nc3ncc(o3)-c3cccc(NC(=O)c4ccccc4)c3)cc12
InChI Key InChIKey=HMPJIULJJHPWDR-UHFFFAOYSA-N
Data  1 IC50
  Tab Delimited (TSV)   2D SDfile   Computed 3D by Vconf -m prep SDfile
Find this compound or compounds like it in BindingDB:
Activity Spreadsheet -- Enzyme Inhibition Constant Data from BindingDB
Found 1 hit for monomerid = 50133714
TargetInosine-5'-monophosphate dehydrogenase 2(Homo sapiens (Human))
Bristol-Myers Squibb Pharmaceutical Research Institute
Curated by ChEMBL
LigandPNGBDBM50133714(CHEMBL327031 | N-{3-[2-(3-Cyano-1-methyl-1H-indol-...)
Affinity DataIC50:  200nM. Assay description: Inhibitory activity tested against inosine-5'-monophosphate dehydrogenase 2 (IMPDH-II) enzyme
In DepthDetails ArticlePubMed