BDBM50134424 CHEMBL332973::[2-(2-{2-[4-((8R,9R)-7,7-Dibutyl-2-dimethylamino-8-hydroxy-5,5-dioxo-6,7,8,9-tetrahydro-5H-5lambda*6*-thia-6-aza-benzocyclohepten-9-yl)-phenoxy]-ethoxy}-ethoxy)-ethyl]-triethyl-ammonium; iodide
SMILES CCCCC1(CCCC)NS(=O)(=O)c2ccc(cc2[C@H]([C@H]1O)c1ccc(OCCOCCOCC[N+](CC)(CC)CC)cc1)N(C)C
InChI Key InChIKey=IKRBHWQIBMCLFI-LQFQNGICSA-N
Data  1 IC50
  Tab Delimited (TSV)   2D SDfile   Computed 3D by Vconf -m prep SDfile
Find this compound or compounds like it in BindingDB:
Activity Spreadsheet -- Enzyme Inhibition Constant Data from BindingDB
Found 1 hit for monomerid = 50134424
TargetIleal sodium/bile acid cotransporter(Homo sapiens (Human))
Pfizer
Curated by ChEMBL
LigandPNGBDBM50134424(CHEMBL332973 | [2-(2-{2-[4-((8R,9R)-7,7-Dibutyl-2-...)
Affinity DataIC50:  3nM. Assay description: In vitro inhibitory activity against uptake of [14C]-taurocholate in baby hamster kidney cells transfected with cDNA from human Apical Sodium-Codepen...
In DepthDetails ArticlePubMed