BDBM50135548 (S)-N-[(R)-Cyano-(3-tetrazol-1-yl-benzyloxymethyl)-methyl]-2-phenylamino-3-m-tolyl-propionamide::CHEMBL334631
SMILES Cc1cccc(C[C@H](Nc2ccccc2)C(=O)N[C@@H](COCc2cccc(c2)-n2cnnn2)C#N)c1
InChI Key InChIKey=YGSPCIISBPLKDE-RSXGOPAZSA-N
Data  1 IC50
  Tab Delimited (TSV)   2D SDfile   Computed 3D by Vconf -m prep SDfile
Find this compound or compounds like it in BindingDB:
Activity Spreadsheet -- Enzyme Inhibition Constant Data from BindingDB
Found 1 hit for monomerid = 50135548
TargetCathepsin B(Homo sapiens (Human))
Novartis Institute Of Biomedical Research
Curated by ChEMBL
LigandPNGBDBM50135548((S)-N-[(R)-Cyano-(3-tetrazol-1-yl-benzyloxymethyl)...)
Affinity DataIC50:  17nM. Assay description: Inhibtitory activity against cathepsin B (catB)
In DepthDetails ArticlePubMed