BDBM50135557 4-{3-[(4-Ethyl-pyridine-2-carbonyl)-amino]-naphthalen-2-yloxy}-phthalic acid::CHEMBL133274
SMILES CCc1ccnc(c1)C(=O)Nc1cc2ccccc2cc1Oc1ccc(C(O)=O)c(c1)C(O)=O
InChI Key InChIKey=RUPWEROLIACUAM-UHFFFAOYSA-N
Data  2 IC50
  Tab Delimited (TSV)   2D SDfile   Computed 3D by Vconf -m prep SDfile
Find this compound or compounds like it in BindingDB:
Activity Spreadsheet -- Enzyme Inhibition Constant Data from BindingDB
Found 2 hits for monomerid = 50135557
TargetGlycogen phosphorylase, liver form(Homo sapiens (Human))
Merck Research Laboratories
Curated by ChEMBL
LigandPNGBDBM50135557(4-{3-[(4-Ethyl-pyridine-2-carbonyl)-amino]-naphtha...)
Affinity DataIC50:  4nM. Assay description: Inhibitory activity against HLGP(human liver glycogen phosphorylase)
In DepthDetails ArticlePubMed
TargetGlycogen phosphorylase, muscle form(Homo sapiens (Human))
Merck Research Laboratories
Curated by ChEMBL
LigandPNGBDBM50135557(4-{3-[(4-Ethyl-pyridine-2-carbonyl)-amino]-naphtha...)
Affinity DataIC50:  29nM. Assay description: Inhibitory activity against HMGP(human muscle glycogen phosphorylase)
In DepthDetails ArticlePubMed