BDBM50137050 2-[(2-ammoniopropanoyl)amino]hexanoate::CHEMBL152375
SMILES CCCCC(NC(=O)C(C)[NH3+])C([O-])=O
InChI Key InChIKey=RSIYBPVKRVHPQK-UHFFFAOYSA-N
Data  1 KI
  Tab Delimited (TSV)   2D SDfile   Computed 3D by Vconf -m prep SDfile
Find this compound or compounds like it in BindingDB:
Activity Spreadsheet -- Enzyme Inhibition Constant Data from BindingDB
Found 1 hit for monomerid = 50137050
TargetSolute carrier family 15 member 1(Homo sapiens (Human))
Martin-Luther-University Halle-Wittenberg
Curated by ChEMBL
LigandPNGBDBM50137050(2-[(2-ammoniopropanoyl)amino]hexanoate | CHEMBL152...)
Affinity DataKi:  9.00E+4nM. Assay description: Inhibition constant (Ki) for human intestinal peptide carrier
In DepthDetails ArticlePubMed