BDBM50137236 5-Acetylamino-2-{[2-(3-fluoro-4-trifluoromethyl-phenyl)-5-oxo-oxazol-(4E)-ylidenemethyl]-amino}-benzoic acid::CHEMBL130657
SMILES CC(=O)Nc1ccc(\N=C\c2nc(oc2O)-c2ccc(c(F)c2)C(F)(F)F)c(c1)C(O)=O
InChI Key InChIKey=IWGBHHQXQBSNHT-ZNLRHDTNSA-N
Data  1 IC50
  Tab Delimited (TSV)   2D SDfile   Computed 3D by Vconf -m prep SDfile
Find this compound or compounds like it in BindingDB:
Activity Spreadsheet -- Enzyme Inhibition Constant Data from BindingDB
Found 1 hit for monomerid = 50137236
TargetHolo-[acyl-carrier-protein] synthase(Bacillus subtilis)
Wyeth Research
Curated by ChEMBL
LigandPNGBDBM50137236(5-Acetylamino-2-{[2-(3-fluoro-4-trifluoromethyl-ph...)
Affinity DataIC50:  130nM. Assay description: In vitro inhibitory activity against Holo-[acyl-carrier-protein] synthase was determined using Bacillus subtilis GST-Acp-HTRFassay
In DepthDetails ArticlePubMed