BDBM50137772 CHEMBL91823::N-(3-Cyano-5,6-dihydro-4H-cyclopenta[b]thiophen-2-yl)-2-ethoxy-5-(morpholine-4-sulfonyl)-benzamide
SMILES CCOc1ccc(cc1C(=O)Nc1sc2CCCc2c1C#N)S(=O)(=O)N1CCOCC1
InChI Key InChIKey=HRRFQNORLZCSAX-UHFFFAOYSA-N
Data  2 IC50
  Tab Delimited (TSV)   2D SDfile   Computed 3D by Vconf -m prep SDfile
Find this compound or compounds like it in BindingDB:
Activity Spreadsheet -- Enzyme Inhibition Constant Data from BindingDB
Found 2 hits for monomerid = 50137772
TargetUDP-N-acetylmuramoyl-tripeptide--D-alanyl-D-alanine ligase(Streptococcus pneumoniae (Firmicutes))
University Of Jordan
Curated by ChEMBL
LigandPNGBDBM50137772(CHEMBL91823 | N-(3-Cyano-5,6-dihydro-4H-cyclopenta...)
Affinity DataIC50: >1.00E+5nM. Assay description: Inhibition of Streptococcus pneumoniae MurF
In DepthDetails ArticlePubMed
TargetUDP-N-acetylmuramoyl-tripeptide--D-alanyl-D-alanine ligase(Streptococcus pneumoniae (Firmicutes))
University Of Jordan
Curated by ChEMBL
LigandPNGBDBM50137772(CHEMBL91823 | N-(3-Cyano-5,6-dihydro-4H-cyclopenta...)
Affinity DataIC50: >1.00E+5nM. Assay description: Antibacterial activity against UDP-MurNAc-pentapeptide synthetase from Streptococcus pneumoniae.
In DepthDetails ArticlePubMed