BDBM50137773 4-Chloro-3-[1-(3-cyano-5,6-dihydro-4H-cyclopenta[b]thiophen-2-ylamino)-ethyl]-N,N-diethyl-benzenesulfonamide::4-chloro-3-(1-(3-cyano-5,6-dihydro-4H-cyclopenta[b]thiophen-2-ylamino)ethyl)-N,N-diethylbenzenesulfonamide::CHEMBL91682
SMILES CCN(CC)S(=O)(=O)c1ccc(Cl)c(c1)C(C)Nc1sc2CCCc2c1C#N
InChI Key InChIKey=YGHIZOURQQVFII-UHFFFAOYSA-N
Data  2 IC50
  Tab Delimited (TSV)   2D SDfile   Computed 3D by Vconf -m prep SDfile
Find this compound or compounds like it in BindingDB:
Activity Spreadsheet -- Enzyme Inhibition Constant Data from BindingDB
Found 2 hits for monomerid = 50137773
TargetUDP-N-acetylmuramoyl-tripeptide--D-alanyl-D-alanine ligase(Streptococcus pneumoniae (Firmicutes))
University Of Jordan
Curated by ChEMBL
LigandPNGBDBM50137773(4-Chloro-3-[1-(3-cyano-5,6-dihydro-4H-cyclopenta[b...)
Affinity DataIC50: >1.00E+5nM. Assay description: Inhibition of Streptococcus pneumoniae MurF
In DepthDetails ArticlePubMed
TargetUDP-N-acetylmuramoyl-tripeptide--D-alanyl-D-alanine ligase(Streptococcus pneumoniae (Firmicutes))
University Of Jordan
Curated by ChEMBL
LigandPNGBDBM50137773(4-Chloro-3-[1-(3-cyano-5,6-dihydro-4H-cyclopenta[b...)
Affinity DataIC50: >1.00E+5nM. Assay description: Antibacterial activity against UDP-MurNAc-pentapeptide synthetase from Streptococcus pneumoniae.
In DepthDetails ArticlePubMed